Consenso all'uso dei cookies

SITO1 -- SITO2 -- Forum2 -- CercaGlobale -- Informativa su Cookie e Privacy

Questo Forum1 è in sola lettura -- Usa il Forum2


Valutazione discussione:
  • 0 voto(i) - 0 media
  • 1
  • 2
  • 3
  • 4
  • 5
[RISOLTO] Aggiornamento 12.04 Plus
#1
Salute a tutti.
Oggi ho cercato di aggiornare il software (erano alcuni giorni che non lo facevo) e mi è apparso
   
Come devo procedere? Huh
Help.
Grazie
Meglio una gallina oggi, che un uovo domani Sleepy
Cita messaggio
#2
così http://www.istitutomajorana.it/index.php...&Itemid=33
ogni buon maestro che si fa, invisibile

http://www.virtualinn.it
Cita messaggio
#3
(30-10-2013, 19:57 )pilgrim Ha scritto: così http://www.istitutomajorana.it/index.php...&Itemid=33

Ho fatto quanto suggerito e l'aggiornamento è riuscito, però come succede talvolta quando faccio un aggiornamento importante, mi è apparso "Rete non connessa". Ho sempre rimediato all'inconveniente, come suggeritomi dal forum tempo addietro, con:

tar -xf compat-wireless-3.6.8-1-snpc.tar.bz2
cd compat-wireless-3.6.8-1-snpc
./scripts/driver-select alx
make
sudo make install
modprobe alx


Questa volta però è apparsa la seguente schermata:

sergio@SergioPC:~$ tar -xf compat-wireless-3.6.8-1-snpc.tar.bz2
sergio@SergioPC:~$ cd compat-wireless-3.6.8-1-snpc
sergio@SergioPC:~/compat-wireless-3.6.8-1-snpc$ ./scripts/driver-select alx
Processing new driver-select request...
Backup exists: Makefile.bk
Backup exists: Makefile.bk
Backup exists: drivers/net/ethernet/broadcom/Makefile.bk
Backup exists: drivers/net/ethernet/atheros/Makefile.bk
Backup exists: Makefile.bk
Backup exists: Makefile.bk
Backup exists: drivers/net/ethernet/broadcom/Makefile.bk
sergio@SergioPC:~/compat-wireless-3.6.8-1-snpc$ make
make -C /lib/modules/3.2.0-55-generic-pae/build M=/home/sergio/compat-wireless-3.6.8-1-snpc modules
make[1]: ingresso nella directory "/usr/src/linux-headers-3.2.0-55-generic-pae"
CC [M] /home/sergio/compat-wireless-3.6.8-1-snpc/compat/main.o
In file included from /home/sergio/compat-wireless-3.6.8-1-snpc/include/linux/compat-2.6.h:64:0,
from <command-line>:0:
/home/sergio/compat-wireless-3.6.8-1-snpc/include/linux/compat-3.4.h:32:21: error: redefinition of ‘kmalloc_array’
include/linux/slab.h:243:21: note: previous definition of ‘kmalloc_array’ was here
make[3]: *** [/home/sergio/compat-wireless-3.6.8-1-snpc/compat/main.o] Errore 1
make[2]: *** [/home/sergio/compat-wireless-3.6.8-1-snpc/compat] Errore 2
make[1]: *** [_module_/home/sergio/compat-wireless-3.6.8-1-snpc] Errore 2
make[1]: uscita dalla directory "/usr/src/linux-headers-3.2.0-55-generic-pae"
make: *** [modules] Errore 2
sergio@SergioPC:~/compat-wireless-3.6.8-1-snpc$ sudo make install
[sudo] password for sergio:
Sorry, try again.
[sudo] password for sergio:
Updating Ubuntu's initramfs for 3.2.0-55-generic-pae under /boot/ ...
Will now run update-grub to ensure grub will find the new initramfs ...
Generating grub.cfg ...
Found linux image: /boot/vmlinuz-3.2.0-55-generic-pae
Found initrd image: /boot/initrd.img-3.2.0-55-generic-pae
Found linux image: /boot/vmlinuz-3.2.0-54-generic-pae
Found initrd image: /boot/initrd.img-3.2.0-54-generic-pae
Found linux image: /boot/vmlinuz-3.2.0-53-generic-pae
Found initrd image: /boot/initrd.img-3.2.0-53-generic-pae
Found linux image: /boot/vmlinuz-3.2.0-52-generic-pae
Found initrd image: /boot/initrd.img-3.2.0-52-generic-pae
Found linux image: /boot/vmlinuz-3.2.0-51-generic-pae
Found initrd image: /boot/initrd.img-3.2.0-51-generic-pae
Found linux image: /boot/vmlinuz-3.2.0-49-generic-pae
Found initrd image: /boot/initrd.img-3.2.0-49-generic-pae
Found linux image: /boot/vmlinuz-3.2.0-48-generic-pae
Found initrd image: /boot/initrd.img-3.2.0-48-generic-pae
Found linux image: /boot/vmlinuz-3.2.0-45-generic-pae
Found initrd image: /boot/initrd.img-3.2.0-45-generic-pae
Found linux image: /boot/vmlinuz-3.2.0-44-generic-pae
Found initrd image: /boot/initrd.img-3.2.0-44-generic-pae
Found linux image: /boot/vmlinuz-3.2.0-24-generic-pae
Found initrd image: /boot/initrd.img-3.2.0-24-generic-pae
Found memtest86+ image: /boot/memtest86+.bin
Found Windows 7 (loader) on /dev/sda1
done

make -C /lib/modules/3.2.0-55-generic-pae/build M=/home/sergio/compat-wireless-3.6.8-1-snpc modules
make[1]: ingresso nella directory "/usr/src/linux-headers-3.2.0-55-generic-pae"
CC [M] /home/sergio/compat-wireless-3.6.8-1-snpc/compat/main.o
In file included from /home/sergio/compat-wireless-3.6.8-1-snpc/include/linux/compat-2.6.h:64:0,
from <command-line>:0:
/home/sergio/compat-wireless-3.6.8-1-snpc/include/linux/compat-3.4.h:32:21: error: redefinition of ‘kmalloc_array’
include/linux/slab.h:243:21: note: previous definition of ‘kmalloc_array’ was here
make[3]: *** [/home/sergio/compat-wireless-3.6.8-1-snpc/compat/main.o] Errore 1
make[2]: *** [/home/sergio/compat-wireless-3.6.8-1-snpc/compat] Errore 2
make[1]: *** [_module_/home/sergio/compat-wireless-3.6.8-1-snpc] Errore 2
make[1]: uscita dalla directory "/usr/src/linux-headers-3.2.0-55-generic-pae"
make: *** [modules] Errore 2
sergio@SergioPC:~/compat-wireless-3.6.8-1-snpc$


e non si connette alla rete. Huh
Help
Grazie
Cita messaggio
#4
Ho spostato la discussione in "Ubuntu Errori Aggiornamenti - Medibuntu" perchè mi sembrava più pertinente.
Chiuderò poi questa discussione con RISOLTO.
Pinguino
Cita messaggio


Vai al forum:


Utenti che stanno guardando questa discussione: 1 Ospite(i)