SITO1 -- SITO2 -- Forum1 -- CercaGlobale -- Informativa su Cookie e Privacy


Valutazione discussione:
  • 0 voto(i) - 0 media
  • 1
  • 2
  • 3
  • 4
  • 5
Adattatore wireless per Raspberry
#11
Ho attivato il SU e ho rilanciato lo script.

Questa è la parte terminale, con errore, della sequenza fatta:

Authentication requested [root] for make driver:
make ARCH=armv7l CROSS_COMPILE= -C /lib/modules/4.4.45-v7+/build M=/home/pi/Desktop/RTL8188C_8192C_USB_linux_v4.0.2_9000.20130911/driver/rtl8188C_8192C_usb_linux_v4.0.2_9000.20130911  modules
make[1]: *** /lib/modules/4.4.45-v7+/build: File o directory non esistente.  Arresto.
Makefile:584: set di istruzioni per l'obiettivo "modules" non riuscito
make: *** [modules] Errore 2
##################################################
Compile make driver error: 2
Please check error Mesg
##################################################

Allego il file della sequenza completo.


Allegati
.txt   SEQUENZA SCRIPT-2.txt (Dimensione: 13,82 KB / Download: 0)
Cita messaggio
Grazie da:
#12
Cosa  intende per "Please check error Mesg".

C'è un file dei messaggi di errore?, dove?
Cita messaggio
Grazie da:
#13
(03-02-2017,11:52 )luipez Ha scritto: Cosa  intende per "Please check error Mesg".

C'è un file dei messaggi di errore?, dove?

Dovrebbe essere sotto /var/log/mesg
Ora non posso controllare sul raspberry, sono fuori casa.
Linux User # 207701 - Non ho particolari talenti. Sono soltanto appassionatamente curioso - Albert Einstein
Cita messaggio
Grazie da:
#14
(03-02-2017,11:20 )luipez Ha scritto: Ho attivato il SU e ho rilanciato lo script.

Questa è la parte terminale, con errore, della sequenza fatta:

Authentication requested [root] for make driver:
make ARCH=armv7l CROSS_COMPILE= -C /lib/modules/4.4.45-v7+/build M=/home/pi/Desktop/RTL8188C_8192C_USB_linux_v4.0.2_9000.20130911/driver/rtl8188C_8192C_usb_linux_v4.0.2_9000.20130911  modules
make[1]: *** /lib/modules/4.4.45-v7+/build: File o directory non esistente.  Arresto.
Makefile:584: set di istruzioni per l'obiettivo "modules" non riuscito
make: *** [modules] Errore 2
##################################################
Compile make driver error: 2
Please check error Mesg
##################################################
Allego il file della sequenza completo.

Da quanto sopra mi è sembrato di capire che la cartella "build" non esisteva nel percorso.

L'ho creata, con permessi 0755, e ho rilanciato lo script, ora ha dato un altro errore:

Authentication requested [root] for make driver:
make ARCH=armv7l CROSS_COMPILE= -C /lib/modules/4.4.45-v7+/build M=/home/pi/Desktop/RTL8188C_8192C_USB_linux_v4.0.2_9000.20130911/driver/rtl8188C_8192C_usb_linux_v4.0.2_9000.20130911  modules
make[1]: ingresso nella directory "/lib/modules/4.4.45-v7+/build"
make[1]: ***  Nessuna regola per generare l'obiettivo "modules".  Arresto.
make[1]: uscita dalla directory "/lib/modules/4.4.45-v7+/build"
Makefile:584: set di istruzioni per l'obiettivo "modules" non riuscito
make: *** [modules] Errore 2
##################################################
Compile make driver error: 2
Please check error Mesg
##################################################

Adesso non capisco l'errore, mi affido alla tua esperienza.

update: facendo qualche ricerca ho trovato questo link:

http://forum.ubuntu.it/viewtopic.php?f=97&t=590960

in cui si dice che i driver in questione sono validi fino al kernel 3.9, per cui col 4.xx non sono buoni.

E' vero?

Attendo tuoi Lumi
Cita messaggio
Grazie da:
#15
Nel file "messages" ho notato una serie di queste righe:

action 'action 17' suspended, next retry is Sat Feb 4 10:28:30 2017 [try http://www.rsyslog.com/e/2007 ]

scritte a distanza di pochi minuti.

Cercando su Google ho letto che è un bug di Debian non ancora corretto  e che si poteva ovviare facendo quanto indicato quì:

https://blog.dantup.com/2016/04/removing...an-jessie/

pensi sia il caso di farlo?

Fammi sapere
 
Grazie
Cita messaggio
Grazie da:
#16
(04-02-2017,10:59 )luipez Ha scritto:
(03-02-2017,11:20 )luipez Ha scritto: Ho attivato il SU e ho rilanciato lo script.

Questa è la parte terminale, con errore, della sequenza fatta:

Authentication requested [root] for make driver:
make ARCH=armv7l CROSS_COMPILE= -C /lib/modules/4.4.45-v7+/build M=/home/pi/Desktop/RTL8188C_8192C_USB_linux_v4.0.2_9000.20130911/driver/rtl8188C_8192C_usb_linux_v4.0.2_9000.20130911  modules
make[1]: *** /lib/modules/4.4.45-v7+/build: File o directory non esistente.  Arresto.
Makefile:584: set di istruzioni per l'obiettivo "modules" non riuscito
make: *** [modules] Errore 2
##################################################
Compile make driver error: 2
Please check error Mesg
##################################################
Allego il file della sequenza completo.

Da quanto sopra mi è sembrato di capire che la cartella "build" non esisteva nel percorso.

L'ho creata, con permessi 0755, e ho rilanciato lo script, ora ha dato un altro errore:

Authentication requested [root] for make driver:
make ARCH=armv7l CROSS_COMPILE= -C /lib/modules/4.4.45-v7+/build M=/home/pi/Desktop/RTL8188C_8192C_USB_linux_v4.0.2_9000.20130911/driver/rtl8188C_8192C_usb_linux_v4.0.2_9000.20130911  modules
make[1]: ingresso nella directory "/lib/modules/4.4.45-v7+/build"
make[1]: ***  Nessuna regola per generare l'obiettivo "modules".  Arresto.
make[1]: uscita dalla directory "/lib/modules/4.4.45-v7+/build"
Makefile:584: set di istruzioni per l'obiettivo "modules" non riuscito
make: *** [modules] Errore 2
##################################################
Compile make driver error: 2
Please check error Mesg
##################################################

Adesso non capisco l'errore, mi affido alla tua esperienza.

update: facendo qualche ricerca ho trovato questo link:

http://forum.ubuntu.it/viewtopic.php?f=97&t=590960

in cui si dice che i driver in questione sono validi fino al kernel 3.9, per cui col 4.xx non sono buoni.

E' vero?

Attendo tuoi Lumi

Controllando con lsusb l'adattatore viene così individuato:

ID 148f:7601 Ralink Technology, Corp.

Cercando in rete ho trovato questo link, può aiutarti?

https://groenholdt.net/Computers/Raspber...ry-Pi.html

e anche questo:

http://forum.debianizzati.org/viewtopic....5&start=30
Cita messaggio
Grazie da:
#17
per l'errore "action 17" prova a fare come spiegato nel link che hai postato, evitando di eliminare le righe menzionate, ma solo commentandole mettendo all'inizio di ognuna di quelle righe il cancelletto "#" . cosi potrai se dovessi avere problemi semplicemente decommentarle per ripristinare il file originale.
per i driver che hai trovato a seguito di quanto riportato da lsusb, controlla se il tuo kernel è 4.2 o superiore. se fosse superiore , dato che indica il driver presente nel kernel prova a caricarlo con :
Codice:
sudo modprobe mt7601u
se non ci fosse prova a seguire la procedura indicata per kernel inferiori da 3.9 a 4.2.
per sapere la versione del kernel in uso:
Codice:
uname -r
Linux User # 207701 - Non ho particolari talenti. Sono soltanto appassionatamente curioso - Albert Einstein
Cita messaggio
Grazie da:


Vai al forum:


Utenti che stanno guardando questa discussione: